Target
Plasmepsin II
Ligand
BDBM50514493
Substrate
Meas. Tech.
ChEMBL_1856924 (CHEMBL4357653)
IC50
<10.0±n/a nM
Citation
 Cheuka, PMDziwornu, GOkombo, JChibale, K Plasmepsin Inhibitors in Antimalarial Drug Discovery: Medicinal Chemistry and Target Validation (2000 to Present). J Med Chem 63:4445-4467 (2020)  
Target
Name:
Plasmepsin II
Synonyms:
Aspartic hemoglobinase II PLM2_PLAFX Plasmepsin 2 Plasmepsin-II
Type:
Enzyme
Mol. Mass.:
51482.09
Organism:
Plasmodium falciparum
Description:
P46925
Residue:
453
  
Inhibitor
Name:
BDBM50514493
Synonyms:
CHEMBL4440178
Type:
Small organic molecule
Emp. Form.:
C39H43BrFN3O5
Mol. Mass.:
732.678
SMILES:
COC(=O)CCCC(=O)N1CC2CC(=C(C(C1)N2)C(=O)N(Cc1ccccc1)C1CC1)c1ccc(CCCOc2cc(F)ccc2Br)cc1
: