Target
Serine/threonine-protein kinase B-raf
Ligand
BDBM50514788
Substrate
Meas. Tech.
ChEMBL_1858521 (CHEMBL4359250)
Kd
2.7±n/a nM
Citation
 Han, XRChen, LWei, YYu, WChen, YZhang, CJiao, BShi, TSun, LZhang, CXu, YLee, MRLuo, YPlewe, MBWang, J Discovery of Selective Small Molecule Degraders of BRAF-V600E. J Med Chem 63:4069-4080 (2020)  
Target
Name:
Serine/threonine-protein kinase B-raf
Synonyms:
B-RAF B-Raf proto-oncogene serine/threonine-protein kinase BRAF1 RAFB1 v-Raf murine sarcoma viral oncogene homolog B1
Type:
Serine/threonine-protein kinase
Mol. Mass.:
84446.00
Organism:
Homo sapiens (Human)
Description:
P15056
Residue:
766
  
Inhibitor
Name:
BDBM50514788
Synonyms:
CHEMBL4440761
Type:
Small organic molecule
Emp. Form.:
C49H56F2N10O10S
Mol. Mass.:
1015.092
SMILES:
CCCS(=O)(=O)Nc1ccc(F)c(c1F)-n1cc(-c2cncnc2)c2nc(ccc12)N(C)C1CCN(CC1)C(=O)CCOCCOCCOCCNc1cccc2C(=O)N(C3CCC(=O)N(C)C3=O)C(=O)c12
: