Target
Tyrosine-protein kinase Fes/Fps
Ligand
BDBM50515040
Substrate
Meas. Tech.
ChEMBL_1859774 (CHEMBL4360630)
IC50
494±n/a nM
Citation
 Yuan, TQi, BJiang, ZDong, WZhong, LBai, LTong, RYu, JShi, J Dual FLT3 inhibitors: Against the drug resistance of acute myeloid leukemia in recent decade. Eur J Med Chem 178:468-483 (2019)  
Target
Name:
Tyrosine-protein kinase Fes/Fps
Synonyms:
FES FPS Tyrosine-protein kinase Fes/Fps
Type:
Enzyme
Mol. Mass.:
93498.99
Organism:
Homo sapiens (Human)
Description:
P07332
Residue:
822
  
Inhibitor
Name:
BDBM50515040
Synonyms:
CHEMBL4474361
Type:
Small organic molecule
Emp. Form.:
C26H31N7O4S
Mol. Mass.:
537.634
SMILES:
COc1cc(ccc1Nc1nc(Nc2ccccc2S(=O)(=O)C(C)C)c2cn[nH]c2n1)N1CCC(O)CC1
: