Target
17-beta-hydroxysteroid dehydrogenase type 2
Ligand
BDBM50515437
Substrate
Meas. Tech.
ChEMBL_1861097 (CHEMBL4361953)
IC50
5.7±n/a nM
Citation
 Abdelsamie, ASSalah, MSiebenbürger, LMerabet, AScheuer, CFrotscher, MMüller, STZierau, OVollmer, GMenger, MDLaschke, MWvan Koppen, CJMarchais-Oberwinkler, SHartmann, RW Design, Synthesis, and Biological Characterization of Orally Active 17?-Hydroxysteroid Dehydrogenase Type 2 Inhibitors Targeting the Prevention of Osteoporosis. J Med Chem 62:7289-7301 (2019)  
Target
Name:
17-beta-hydroxysteroid dehydrogenase type 2
Synonyms:
17-beta-Hydroxysteroid Dehydrogenase 2 (17-beta-HSD2) 20-alpha-HSD EDH17B2 Estradiol 17-beta-dehydrogenase 2 (17beta-HSD2) Microsomal 17-beta-hydroxysteroid dehydrogenas Testosterone 17-beta-dehydrogenase
Type:
Oxidoreductase; single-pass type II membrane protein
Mol. Mass.:
42795.29
Organism:
Homo sapiens (Human)
Description:
Enzyme was partially purified from human placenta.
Residue:
387
  
Inhibitor
Name:
BDBM50515437
Synonyms:
CHEMBL4471724
Type:
Small organic molecule
Emp. Form.:
C22H12ClF3N2O4S2
Mol. Mass.:
524.92
SMILES:
Oc1c(F)c(F)cc(C(=O)c2ccc(s2)-c2cccc(NS(=O)(=O)c3ccc(Cl)nc3)c2)c1F
: