Target
Cytochrome c oxidase subunit 2
Ligand
BDBM50515745
Substrate
Meas. Tech.
ChEMBL_1862266 (CHEMBL4363122)
IC50
915±n/a nM
Citation
 Kumar, RSaha, NPurohit, PGarg, SKSeth, KMeena, VSDubey, SDave, KGoyal, RSharma, SSBanerjee, UCChakraborti, AK Cyclic enaminone as new chemotype for selective cyclooxygenase-2 inhibitory, anti-inflammatory, and analgesic activities. Eur J Med Chem 182:0 (2019)  
Target
Name:
Cytochrome c oxidase subunit 2
Synonyms:
COII COX2_HUMAN MT-CO2 | MTCO2
Type:
PROTEIN
Mol. Mass.:
25555.66
Organism:
Homo sapiens (Human)
Description:
ChEMBL_530099
Residue:
227
  
Inhibitor
Name:
BDBM50515745
Synonyms:
CHEMBL4474644
Type:
Small organic molecule
Emp. Form.:
C17H20ClNO3
Mol. Mass.:
321.799
SMILES:
CC(C)(C)OC(=O)N(C1=CC(=O)CCC1)c1ccc(Cl)cc1
: