Target
Cytochrome c oxidase subunit 2
Ligand
BDBM50515743
Substrate
Meas. Tech.
ChEMBL_1862266 (CHEMBL4363122)
IC50
367±n/a nM
Citation
 Kumar, RSaha, NPurohit, PGarg, SKSeth, KMeena, VSDubey, SDave, KGoyal, RSharma, SSBanerjee, UCChakraborti, AK Cyclic enaminone as new chemotype for selective cyclooxygenase-2 inhibitory, anti-inflammatory, and analgesic activities. Eur J Med Chem 182:0 (2019)  
Target
Name:
Cytochrome c oxidase subunit 2
Synonyms:
COII COX2_HUMAN MT-CO2 | MTCO2
Type:
PROTEIN
Mol. Mass.:
25555.66
Organism:
Homo sapiens (Human)
Description:
ChEMBL_530099
Residue:
227
  
Inhibitor
Name:
BDBM50515743
Synonyms:
CHEMBL4448990
Type:
Small organic molecule
Emp. Form.:
C14H14ClNO2
Mol. Mass.:
263.719
SMILES:
CC(=O)N(C1=CC(=O)CCC1)c1ccc(Cl)cc1
: