Target
Cannabinoid receptor 1
Ligand
BDBM50516256
Substrate
Meas. Tech.
ChEMBL_1863999 (CHEMBL4364974)
Ki
3.0±n/a nM
Citation
 Amato, GManke, AWiethe, RVasukuttan, VSnyder, RYueh, YLDecker, ARunyon, SMaitra, R Functionalized 6-(Piperidin-1-yl)-8,9-Diphenyl Purines as Peripherally Restricted Inverse Agonists of the CB1 Receptor. J Med Chem 62:6330-6345 (2019)  
Target
Name:
Cannabinoid receptor 1
Synonyms:
CANN6 CB-R CNR CNR1_HUMAN Cannabinoid receptor Cannabinoid receptor 1 (brain)
Type:
G Protein-Coupled Receptor (GPCR)
Mol. Mass.:
52868.96
Organism:
Homo sapiens (Human)
Description:
P21554
Residue:
472
  
Inhibitor
Name:
BDBM50516256
Synonyms:
CHEMBL4555599
Type:
Small organic molecule
Emp. Form.:
C30H26Cl2FN7O
Mol. Mass.:
590.478
SMILES:
Fc1ccc(CNC(=O)NC2CCN(CC2)c2ncnc3n(c(nc23)-c2ccccc2Cl)-c2ccc(Cl)cc2)cc1
: