Target
Neuronal acetylcholine receptor subunit alpha-3/beta-2
Ligand
BDBM50516307
Substrate
Meas. Tech.
ChEMBL_1864293 (CHEMBL4365268)
Kd
1.2±n/a nM
Citation
 Hone, AJFisher, FChristensen, SGajewiak, JLarkin, DWhiteaker, PMcIntosh, JM PeIA-5466: A Novel Peptide Antagonist Containing Non-natural Amino Acids That Selectively Targets ?3?2 Nicotinic Acetylcholine Receptors. J Med Chem 62:6262-6275 (2019)  
Target
Name:
Neuronal acetylcholine receptor subunit alpha-3/beta-2
Synonyms:
Neuronal acetylcholine receptor Alpha-3/Beta-2 Neuronal acetylcholine receptor; alpha3/beta2 | nAChR subtypes alpha3 beta2
Type:
Protein
Mol. Mass.:
Description:
Components:
This complex has 2 components.
Component 1
Name:
Neuronal acetylcholine receptor subunit alpha-3
Synonyms:
ACHA3_RAT Chrna3
Type:
Enzyme
Mol. Mass.:
56995.52
Organism:
Rattus norvegicus (Rat)
Description:
P04757
Residue:
499
  
Component 2
Name:
Neuronal acetylcholine receptor subunit beta-2
Synonyms:
ACHB2_RAT Chrnb2 Neuronal acetylcholine receptor non-alpha-1 chain
Type:
Enzyme
Mol. Mass.:
56910.32
Organism:
Rattus norvegicus (Rat)
Description:
P12390
Residue:
500
  
Inhibitor
Name:
BDBM50516307
Synonyms:
CHEMBL4445542
Type:
Small organic molecule
Emp. Form.:
C72H107N23O21S4
Mol. Mass.:
1759.021
SMILES:
CCCC[C@@H]1NC(=O)[C@H](Cc2cnc[nH]2)NC(=O)[C@@H]2CSSC[C@H](NC(=O)CN)C(=O)N[C@@H](CSSC[C@H](NC(=O)[C@@H](NC(=O)[C@H](CCC(O)=O)NC(=O)[C@@H]3CCCN3C(=O)[C@H](Cc3cnc[nH]3)NC(=O)[C@H](CCCCC(O)=O)NC1=O)[C@@H](C)CC)C(N)=O)C(=O)N[C@@H](CO)C(=O)N[C@@H](Cc1cnc[nH]1)C(=O)N1CCC[C@H]1C(=O)N[C@@H](C)C(=O)N2
: