Target
Cereblon isoform 4
Ligand
BDBM50516585
Substrate
Meas. Tech.
ChEMBL_1866003 (CHEMBL4366978)
Ki
20000±n/a nM
Citation
 Heim, CPliatsika, DMousavizadeh, FBär, KHernandez Alvarez, BGiannis, AHartmann, MD De-Novo Design of Cereblon (CRBN) Effectors Guided by Natural Hydrolysis Products of Thalidomide Derivatives. J Med Chem 62:6615-6629 (2019)  
Target
Name:
Cereblon isoform 4
Synonyms:
Cereblon isoform 4
Type:
PROTEIN
Mol. Mass.:
13620.40
Organism:
Magnetospirillum gryphiswaldense
Description:
ChEMBL_116733
Residue:
124
  
Inhibitor
Name:
BDBM50516585
Synonyms:
CHEMBL4561295
Type:
Small organic molecule
Emp. Form.:
C13H8Cl2N2O3S
Mol. Mass.:
343.185
SMILES:
Clc1c(sc2cccc(Cl)c12)C(=O)NC1CC(=O)NC1=O
: