Target
Acetylcholine receptor subunit epsilon
Ligand
BDBM50516962
Substrate
Meas. Tech.
ChEMBL_1867225 (CHEMBL4368200)
IC50
>350000000±n/a nM
Citation
 Xu, MPeng, YZhu, LWang, SJi, JRakesh, KP Triazole derivatives as inhibitors of Alzheimer's disease: Current developments and structure-activity relationships. Eur J Med Chem 180:656-672 (2019)  
Target
Name:
Acetylcholine receptor subunit epsilon
Synonyms:
ACHE_HUMAN Acetylcholine receptor protein epsilon chain Nicotinic acetylcholine receptor alpha-1/beta-1/delta/epsilon
Type:
PROTEIN
Mol. Mass.:
54686.87
Organism:
Homo sapiens (Human)
Description:
ChEMBL_431077
Residue:
493
  
Inhibitor
Name:
BDBM50516962
Synonyms:
CHEMBL4536136
Type:
Small organic molecule
Emp. Form.:
C26H30N4O6S2
Mol. Mass.:
558.67
SMILES:
CC1(C)Oc2cc3oc(=O)ccc3cc2CC1OC(=O)n1cc(CNC(=O)CCCCC2CCSS2)nn1
: