Target
Progesterone receptor
Ligand
BDBM50071997
Substrate
Meas. Tech.
ChEBML_159728
Ki
1.9±n/a nM
Citation
 Hamann, LGWinn, DTPooley, CLTegley, CMWest, SJFarmer, LJZhi, LEdwards, JPMarschke, KBMais, DEGoldman, MEJones, TK Nonsteroidal progesterone receptor antagonists based on a conformationally-restricted subseries of 6-aryl-1,2-dihydro-2,2,4-trimethylquinolines. Bioorg Med Chem Lett 8:2731-6 (1999)  
Target
Name:
Progesterone receptor
Synonyms:
NR3C3 PGR PRGR_HUMAN | progesterone
Type:
Protein
Mol. Mass.:
98979.52
Organism:
Homo sapiens (Human)
Description:
P06401
Residue:
933
  
Inhibitor
Name:
BDBM50071997
Synonyms:
7-Fluoro-2,2,4-trimethyl-8-nitro-2,10-dihydro-1H-indeno[1,2-g]quinoline | CHEMBL330527
Type:
Small organic molecule
Emp. Form.:
C19H17FN2O2
Mol. Mass.:
324.3489
SMILES:
CC1=CC(C)(C)Nc2cc3Cc4cc(c(F)cc4-c3cc12)[N+]([O-])=O
: