Target
Progesterone receptor
Ligand
BDBM50072011
Substrate
Meas. Tech.
ChEMBL_159728 (CHEMBL766185)
Ki
77±n/a nM
Citation
 Hamann, LGWinn, DTPooley, CLTegley, CMWest, SJFarmer, LJZhi, LEdwards, JPMarschke, KBMais, DEGoldman, MEJones, TK Nonsteroidal progesterone receptor antagonists based on a conformationally-restricted subseries of 6-aryl-1,2-dihydro-2,2,4-trimethylquinolines. Bioorg Med Chem Lett 8:2731-6 (1999)  
Target
Name:
Progesterone receptor
Synonyms:
NR3C3 PGR PRGR_HUMAN | progesterone
Type:
Protein
Mol. Mass.:
98979.52
Organism:
Homo sapiens (Human)
Description:
P06401
Residue:
933
  
Inhibitor
Name:
BDBM50072011
Synonyms:
11-butyl-1,3,3-trimethyl-4,11-dihydro-3H-pyrido[3,2-a]carbazole | CHEMBL330726
Type:
Small organic molecule
Emp. Form.:
C22H26N2
Mol. Mass.:
318.4552
SMILES:
CCCCn1c2ccccc2c2ccc3NC(C)(C)C=C(C)c3c12
: