Target
Progesterone receptor
Ligand
BDBM50072015
Substrate
Meas. Tech.
ChEBML_159728
Ki
53±n/a nM
Citation
 Hamann, LGWinn, DTPooley, CLTegley, CMWest, SJFarmer, LJZhi, LEdwards, JPMarschke, KBMais, DEGoldman, MEJones, TK Nonsteroidal progesterone receptor antagonists based on a conformationally-restricted subseries of 6-aryl-1,2-dihydro-2,2,4-trimethylquinolines. Bioorg Med Chem Lett 8:2731-6 (1999)  
Target
Name:
Progesterone receptor
Synonyms:
NR3C3 PGR PRGR_HUMAN | progesterone
Type:
Protein
Mol. Mass.:
98979.52
Organism:
Homo sapiens (Human)
Description:
P06401
Residue:
933
  
Inhibitor
Name:
BDBM50072015
Synonyms:
5-Chloro-2,2,4-trimethyl-2,10-dihydro-1H-indeno[1,2-g]quinolin-10-ol | CHEMBL330702
Type:
Small organic molecule
Emp. Form.:
C19H18ClNO
Mol. Mass.:
311.805
SMILES:
CC1=CC(C)(C)Nc2cc3C(O)c4ccccc4-c3c(Cl)c12
: