Target
Metabotropic glutamate receptor 8
Ligand
BDBM50072169
Substrate
Meas. Tech.
ChEBML_104637
IC50
340±n/a nM
Citation
 Collado, IEzquerra, JMazón, APedregal, CYruretagoyena, BKingston, AETomlinson, RWright, RAJohnson, BGSchoepp, DD 2,3'-disubstituted-2-(2'-carboxycyclopropyl)glycines as potent and selective antagonists of metabotropic glutamate receptors. Bioorg Med Chem Lett 8:2849-54 (1999)  
Target
Name:
Metabotropic glutamate receptor 8
Synonyms:
GPRC1H GRM8_HUMAN Metabotropic glutamate receptor 8 | metabotropic glutamate 8
Type:
Enzyme Catalytic Domain
Mol. Mass.:
101759.58
Organism:
Homo sapiens (Human)
Description:
metabotropic glutamate 8 GRM8 HUMAN::O00222
Residue:
908
  
Inhibitor
Name:
BDBM50072169
Synonyms:
(1S,2S,3S)-2-[1-Amino-1-carboxy-2-(9H-xanthen-9-yl)-ethyl]-3-pentyl-cyclopropanecarboxylic acid | CHEMBL329920
Type:
Small organic molecule
Emp. Form.:
C25H29NO5
Mol. Mass.:
423.5015
SMILES:
CCCCC[C@@H]1[C@@H]([C@H]1C(N)(CC1c2ccccc2Oc2ccccc12)C(O)=O)C(O)=O
: