Target
Histamine H3 receptor
Ligand
BDBM50517512
Substrate
Meas. Tech.
ChEMBL_1869141 (CHEMBL4370207)
Ki
8.3±n/a nM
Citation
 Nirogi, RShinde, AMohammed, ARBadange, RKReballi, VBandyala, TRSaraf, SKBojja, KManchineella, SAchanta, PKKandukuri, KKSubramanian, RBenade, VPalacharla, RCJayarajan, PPandey, SJasti, V Discovery and Development of N-[4-(1-Cyclobutylpiperidin-4-yloxy)phenyl]-2-(morpholin-4-yl)acetamide Dihydrochloride (SUVN-G3031): A Novel, Potent, Selective, and Orally Active Histamine H J Med Chem 62:1203-1217 (2019)  
Target
Name:
Histamine H3 receptor
Synonyms:
G-protein coupled receptor 97 HH3R HRH3 Histamine H3 receptor (H3) Histamine receptor (H3 and H4)
Type:
G Protein-Coupled Receptor (GPCR)
Mol. Mass.:
48691.47
Organism:
Homo sapiens (Human)
Description:
Binding assays were using CHO cells stably expressing hH3R receptors.
Residue:
445
  
Inhibitor
Name:
BDBM50517512
Synonyms:
CHEMBL4564463
Type:
Small organic molecule
Emp. Form.:
C20H33Cl2N3O3
Mol. Mass.:
434.4
SMILES:
Cl.Cl.CC(C)N1CCC(CC1)Oc1ccc(NC(=O)CN2CCOCC2)cc1
: