Target
Estrogen receptor beta
Ligand
BDBM50106635
Substrate
Meas. Tech.
ChEMBL_1870077 (CHEMBL4371244)
EC50
>10000±n/a nM
Citation
 Hanson, AMPerera, KLISKim, JPandey, RKSweeney, NLu, XImhoff, AMackinnon, ACWargolet, AJVan Hart, RMFrick, KMDonaldson, WASem, DS A-C Estrogens as Potent and Selective Estrogen Receptor-Beta Agonists (SERBAs) to Enhance Memory Consolidation under Low-Estrogen Conditions. J Med Chem 61:4720-4738 (2018)  
Target
Name:
Estrogen receptor beta
Synonyms:
ER-beta ESR2_HUMAN Estradiol receptor beta (ERβ) Estrogen receptor (ER beta) Estrogen receptor beta (ER beta) NR3A2 estrogen beta
Type:
Protein
Mol. Mass.:
59238.43
Organism:
Homo sapiens (Human)
Description:
Q92731
Residue:
530
  
Inhibitor
Name:
BDBM50106635
Synonyms:
(+/-)-2,3-bis(4-hydroxyphenyl)propanenitrile 2,3-bis(4-hydroxyphenyl)propanenitrile DIARYLPROPIONITRILE
Type:
Small organic molecule
Emp. Form.:
C15H13NO2
Mol. Mass.:
239.2692
SMILES:
Oc1ccc(CC(C#N)c2ccc(O)cc2)cc1
: