Target
Estrogen receptor
Ligand
BDBM50106635
Substrate
Meas. Tech.
ChEMBL_1870096 (CHEMBL4371263)
EC50
>10000±n/a nM
Citation
 Hanson, AMPerera, KLISKim, JPandey, RKSweeney, NLu, XImhoff, AMackinnon, ACWargolet, AJVan Hart, RMFrick, KMDonaldson, WASem, DS A-C Estrogens as Potent and Selective Estrogen Receptor-Beta Agonists (SERBAs) to Enhance Memory Consolidation under Low-Estrogen Conditions. J Med Chem 61:4720-4738 (2018)  
Target
Name:
Estrogen receptor
Synonyms:
ER ESR ESR1_HUMAN Estrogen receptor Estrogen receptor (ER-alpha) Estrogen receptor alpha (ER) Nuclear receptor subfamily 3 group A member 1
Type:
Protein
Mol. Mass.:
66230.44
Organism:
Homo sapiens (Human)
Description:
P03372
Residue:
595
  
Inhibitor
Name:
BDBM50106635
Synonyms:
(+/-)-2,3-bis(4-hydroxyphenyl)propanenitrile 2,3-bis(4-hydroxyphenyl)propanenitrile DIARYLPROPIONITRILE
Type:
Small organic molecule
Emp. Form.:
C15H13NO2
Mol. Mass.:
239.2692
SMILES:
Oc1ccc(CC(C#N)c2ccc(O)cc2)cc1
: