Target
Coagulation factor X
Ligand
BDBM50062035
Substrate
Meas. Tech.
ChEBML_226349
Ki
34±n/a nM
Citation
 Fevig, JMCacciola, JAlexander, RSKnabb, RMLam, GNWong, PCWexler, RR Preparation of meta-amidino-N,N-disubstituted anilines as potent inhibitors of coagulation factor Xa. Bioorg Med Chem Lett 8:3143-8 (1999)  
Target
Name:
Coagulation factor X
Synonyms:
F10 | FA10_RABIT
Type:
PROTEIN
Mol. Mass.:
53951.21
Organism:
Oryctolagus cuniculus
Description:
ChEMBL_1471174
Residue:
490
  
Inhibitor
Name:
BDBM50062035
Synonyms:
5-(4-Carbamimidoyl-phenyl)-3-(3-carbamimidoyl-phenyl)-pentanoic acid methyl ester CHEMBL317923
Type:
Small organic molecule
Emp. Form.:
C20H24N4O2
Mol. Mass.:
352.4302
SMILES:
COC(=O)CC(CCc1ccc(cc1)C(N)=N)c1cccc(c1)C(N)=N
: