Target
Trypsin
Ligand
BDBM50072444
Substrate
Meas. Tech.
ChEMBL_226353 (CHEMBL847138)
Ki
52±n/a nM
Citation
 Fevig, JMCacciola, JAlexander, RSKnabb, RMLam, GNWong, PCWexler, RR Preparation of meta-amidino-N,N-disubstituted anilines as potent inhibitors of coagulation factor Xa. Bioorg Med Chem Lett 8:3143-8 (1999)  
Target
Name:
Trypsin
Synonyms:
Serine protease 1/Trypsin-2/Trypsin-3
Type:
Mol. Mass.:
Description:
ASSAY_ID of ChEMBL is 2155713
Components:
This complex has 3 components.
Component 1
Name:
Serine protease 1
Synonyms:
Alpha-trypsin chain 1 Beta-trypsin PRSS1 TRP1 TRY1_HUMAN Thrombin & trypsin Trypsin I | Trypsin-1
Type:
Enzyme
Mol. Mass.:
26557.80
Organism:
Homo sapiens (Human)
Description:
P07477
Residue:
247
  
Component 2
Name:
Trypsin-2
Synonyms:
Anionic trypsinogen Serine protease 2 TRY2_HUMAN Thrombin & trypsin Trypsin II | Trypsin-2
Type:
PROTEIN
Mol. Mass.:
26479.43
Organism:
Homo sapiens (Human)
Description:
ChEMBL_41517
Residue:
247
  
Component 3
Name:
Trypsin-3
Synonyms:
Brain trypsinogen PRSS3 Serine protease 3 TRY3 TRY4 Trypsin Trypsin IV | Trypsin-3
Type:
PROTEIN
Mol. Mass.:
32532.52
Organism:
Homo sapiens (Human)
Description:
ChEMBL_216043
Residue:
304
  
Inhibitor
Name:
BDBM50072444
Synonyms:
CHEMBL320934 | {(3-Carbamimidoyl-phenyl)-[2-(2'-sulfamoyl-biphenyl-4-yloxy)-ethyl]-amino}-acetic acid isopropyl ester; TFA
Type:
Small organic molecule
Emp. Form.:
C26H30N4O5S
Mol. Mass.:
510.605
SMILES:
CC(C)OC(=O)CN(CCOc1ccc(cc1)-c1ccccc1S(N)(=O)=O)c1cccc(c1)C(N)=N
: