Target
Prothrombin
Ligand
BDBM50072448
Substrate
Meas. Tech.
ChEBML_226352
Ki
200±n/a nM
Citation
 Fevig, JMCacciola, JAlexander, RSKnabb, RMLam, GNWong, PCWexler, RR Preparation of meta-amidino-N,N-disubstituted anilines as potent inhibitors of coagulation factor Xa. Bioorg Med Chem Lett 8:3143-8 (1999)  
Target
Name:
Prothrombin
Synonyms:
Activation peptide fragment 1 Coagulation factor II Prothrombin precursor Thrombin heavy chain | Thrombin light chain
Type:
Protein
Mol. Mass.:
70029.57
Organism:
Homo sapiens (Human)
Description:
P00734
Residue:
622
  
Inhibitor
Name:
BDBM50072448
Synonyms:
CHEMBL18767 | {(3-Carbamimidoyl-phenyl)-[3-(2'-sulfamoyl-biphenyl-4-yl)-propyl]-amino}-acetic acid methyl ester; TFA
Type:
Small organic molecule
Emp. Form.:
C25H28N4O4S
Mol. Mass.:
480.579
SMILES:
COC(=O)CN(CCCc1ccc(cc1)-c1ccccc1S(N)(=O)=O)c1cccc(c1)C(N)=N
: