Target
Tissue alpha-L-fucosidase
Ligand
BDBM50072687
Substrate
Meas. Tech.
ChEMBL_216273 (CHEMBL819880)
Ki
19±n/a nM
Citation
 Wischnat, RMartin, RTakayama, SWong, CH Chemoenzymatic synthesis of iminocyclitol derivatives: a useful library strategy for the development of selective fucosyltransfer enzymes inhibitors. Bioorg Med Chem Lett 8:3353-8 (1999)  
Target
Name:
Tissue alpha-L-fucosidase
Synonyms:
Alpha-L-fucosidase I FUCA1 Tissue alpha-L-fucosidase
Type:
PROTEIN
Mol. Mass.:
53690.69
Organism:
Homo sapiens (Human)
Description:
ChEMBL_34088
Residue:
466
  
Inhibitor
Name:
BDBM50072687
Synonyms:
(S)-2-Amino-3-hydroxy-N-(3,4,5-trihydroxy-2-hydroxymethyl-6-methyl-piperidin-2-ylmethyl)-propionamide | CHEMBL539176
Type:
Small organic molecule
Emp. Form.:
C11H23N3O6
Mol. Mass.:
293.3168
SMILES:
CC1NC(CO)(CNC(=O)[C@@H](N)CO)C(O)C(O)C1O
: