Target
TYR_PHOSPHATASE_2 domain-containing protein
Ligand
BDBM50518483
Substrate
Meas. Tech.
ChEMBL_1871707 (CHEMBL4372874)
Ki
1800±n/a nM
Citation
 Thanh, NDHai, DSHa, NTTTung, DTLe, CTVan, HTKToan, VNToan, DNDang, LH Synthesis, biological evaluation and molecular docking study of 1,2,3-1H-triazoles having 4H-pyrano[2,3-d]pyrimidine as potential Mycobacterium tuberculosis protein tyrosine phosphatase B inhibitors. Bioorg Med Chem Lett 29:164-171 (2019)  
Target
Name:
TYR_PHOSPHATASE_2 domain-containing protein
Synonyms:
(PROTEIN-TYROSINE-PHOSPHATASE) (PTPase) PHOSPHOTYROSINE PROTEIN PHOSPHATASE PTPB Phosphotyrosine-protein phosphatase PTPB | Protein Tyrosine Phosphatase PTPB
Type:
Hydrolase
Mol. Mass.:
30152.45
Organism:
Mycobacterium tuberculosis
Description:
Residue:
276
  
Inhibitor
Name:
BDBM50518483
Synonyms:
CHEMBL4462119
Type:
Small organic molecule
Emp. Form.:
C35H38BrN5O13
Mol. Mass.:
816.606
SMILES:
CCOC(=O)C1=C(C)Oc2nc(C)n(Cc3cn(nn3)[C@@H]3O[C@H](COC(C)=O)[C@@H](OC(C)=O)[C@H](OC(C)=O)[C@H]3OC(C)=O)c(=O)c2C1c1ccc(Br)cc1
: