Target
Histone deacetylase 7
Ligand
BDBM50105327
Substrate
Meas. Tech.
ChEMBL_1875452 (CHEMBL4376741)
IC50
4.0±n/a nM
Citation
 Shouksmith, AEGawel, JMNawar, NSina, DRaouf, YSBukhari, SHe, LJohns, AEManaswiyoungkul, POlaoye, OOCabral, ADSedighi, Ade Araujo, EDGunning, PT Class I/IIb-Selective HDAC Inhibitor Exhibits Oral Bioavailability and Therapeutic Efficacy in Acute Myeloid Leukemia. ACS Med Chem Lett 11:56-64 (2020)  
Target
Name:
Histone deacetylase 7
Synonyms:
HD7 HDAC7A Histone acetylase 7 (HDAC7) Human HDAC7
Type:
Chromatin regulator; hydrolase; repressor
Mol. Mass.:
102942.62
Organism:
Homo sapiens (Human)
Description:
Q8WUI4
Residue:
952
  
Inhibitor
Name:
BDBM50105327
Synonyms:
JNJ-26481585 | Quisinostat
Type:
Small organic molecule
Emp. Form.:
C21H26N6O2
Mol. Mass.:
394.4701
SMILES:
Cn1cc(CNCC2CCN(CC2)c2ncc(cn2)C(=O)NO)c2ccccc12
: