Target
Adenosine deaminase
Ligand
BDBM50367032
Substrate
Meas. Tech.
ChEMBL_1875740 (CHEMBL4377134)
Ki
0.080000±n/a nM
Citation
 Cheviet, TLefebvre-Tournier, IWein, SPeyrottes, S Plasmodium Purine Metabolism and Its Inhibition by Nucleoside and Nucleotide Analogues. J Med Chem 62:8365-8391 (2019)  
Target
Name:
Adenosine deaminase
Synonyms:
3.5.4.4 | Adenosine deaminase
Type:
PROTEIN
Mol. Mass.:
42457.37
Organism:
Plasmodium falciparum
Description:
ChEMBL_119120
Residue:
367
  
Inhibitor
Name:
BDBM50367032
Synonyms:
COFORMYCIN
Type:
Small organic molecule
Emp. Form.:
C11H16N4O5
Mol. Mass.:
284.2685
SMILES:
OC[C@H]1O[C@H]([C@H](O)[C@@H]1O)n1cnc2[C@H](O)CNC=Nc12
: