Target
E3 SUMO-protein ligase CBX4
Ligand
BDBM50519512
Substrate
Meas. Tech.
ChEMBL_1875893 (CHEMBL4377287)
Kd
94±n/a nM
Citation
 Xiong, YGreschik, HJohansson, CSeifert, LBacher, JPark, KSBabault, NMartini, MFagan, VLi, FChau, IChristott, TDilworth, DBarsyte-Lovejoy, DVedadi, MArrowsmith, CHBrennan, PFedorov, OJung, MFarnie, GLiu, JOppermann, USchüle, RJin, J Discovery of a Potent and Selective Fragment-like Inhibitor of Methyllysine Reader Protein Spindlin 1 (SPIN1). J Med Chem 62:8996-9007 (2019)  
Target
Name:
E3 SUMO-protein ligase CBX4
Synonyms:
6.3.2.- CBX4_HUMAN Pc2 hPc2
Type:
PROTEIN
Mol. Mass.:
61401.05
Organism:
Homo sapiens (Human)
Description:
ChEMBL_108273
Residue:
560
  
Inhibitor
Name:
BDBM50519512
Synonyms:
CHEMBL4449240
Type:
Small organic molecule
Emp. Form.:
C37H62N6O8
Mol. Mass.:
718.9236
SMILES:
CCN(CC)CCCC[C@H](NC(=O)[C@H](CC(C)C)NC(=O)[C@H](C)NC(=O)[C@H](C)NC(=O)c1ccc(cc1)C(C)(C)C)C(=O)N[C@@H](CO)C(=O)OC
: