Target
Vascular endothelial growth factor receptor 2
Ligand
BDBM50344664
Substrate
Meas. Tech.
ChEMBL_1876845 (CHEMBL4378239)
IC50
100±n/a nM
Citation
 Kong, XPan, PSun, HXia, HWang, XLi, YHou, T Drug Discovery Targeting Anaplastic Lymphoma Kinase (ALK). J Med Chem 62:10927-10954 (2019)  
Target
Name:
Vascular endothelial growth factor receptor 2
Synonyms:
CD_antigen=CD309 Fetal liver kinase 1 (FLK-1) KDR Protein-tyrosine kinase receptor Flk-1 VEGFR-2 VEGFR2 Vascular Endothelial Growth Factor Receptor Kinase 2 Vascular endothelial growth factor receptor 2 (KDR) Vascular endothelial growth factor receptor 2 (VEGFR2) Vascular endothelial growth factor receptor-2 (VEGFR-2)
Type:
Receptor Tyrosine Kinase
Mol. Mass.:
151510.97
Organism:
Homo sapiens (Human)
Description:
P35968
Residue:
1356
  
Inhibitor
Name:
BDBM50344664
Synonyms:
6,6-dimethyl-8-(1-(oxetan-3-yl)piperidin-4-yl)-11-oxo-6,11-dihydro-5H-benzo[b]carbazole-3-carbonitrile US9126931, 178
Type:
Small organic molecule
Emp. Form.:
C27H27N3O2
Mol. Mass.:
425.5222
SMILES:
CC1(C)c2[nH]c3cc(ccc3c2C(=O)c2ccc(cc12)C1CCN(CC1)C1COC1)C#N
: