Target
Prostaglandin G/H synthase 2
Ligand
BDBM50029600
Substrate
Meas. Tech.
ChEBML_159758
IC50
190±n/a nM
Citation
 Bayly, CIBlack, WCLéger, SOuimet, NOuellet, MPercival, MD Structure-based design of COX-2 selectivity into flurbiprofen. Bioorg Med Chem Lett 9:307-12 (1999)  
Target
Name:
Prostaglandin G/H synthase 2
Synonyms:
COX2 Cyclooxygenase 2 (COX-2) Cyclooxygenase-2 (COX-2 AA) Cyclooxygenase-2 (COX-2) PGH2_HUMAN PHS II Prostaglandin E synthase/G/H synthase 2 Prostaglandin-endoperoxide synthase 2
Type:
Enzyme
Mol. Mass.:
69003.89
Organism:
Homo sapiens (Human)
Description:
Recombinant Cox-2 provided by Cayman (Cayman Chemical Co.,Ann Arbor, MI).
Residue:
604
  
Inhibitor
Name:
BDBM50029600
Synonyms:
5-Bromo-2-(4-fluoro-phenyl)-3-(4-methanesulfonyl-phenyl)-thiophene CHEMBL42485 | DUP-697
Type:
Small organic molecule
Emp. Form.:
C17H12BrFO2S2
Mol. Mass.:
411.308
SMILES:
CS(=O)(=O)c1ccc(cc1)-c1cc(Br)sc1-c1ccc(F)cc1
: