Target
Prostaglandin G/H synthase 1
Ligand
BDBM50029600
Substrate
Meas. Tech.
ChEBML_159281
IC50
4600±n/a nM
Citation
 Bayly, CIBlack, WCLéger, SOuimet, NOuellet, MPercival, MD Structure-based design of COX-2 selectivity into flurbiprofen. Bioorg Med Chem Lett 9:307-12 (1999)  
Target
Name:
Prostaglandin G/H synthase 1
Synonyms:
COX1 Cyclooxygenase-1 (COX-1) PTGS1 | Prostaglandin G/H synthase (cyclooxygenase)
Type:
Protein
Mol. Mass.:
68868.60
Organism:
Ovis aries (Sheep)
Description:
Residue:
600
  
Inhibitor
Name:
BDBM50029600
Synonyms:
5-Bromo-2-(4-fluoro-phenyl)-3-(4-methanesulfonyl-phenyl)-thiophene CHEMBL42485 | DUP-697
Type:
Small organic molecule
Emp. Form.:
C17H12BrFO2S2
Mol. Mass.:
411.308
SMILES:
CS(=O)(=O)c1ccc(cc1)-c1cc(Br)sc1-c1ccc(F)cc1
: