Target
Monoglyceride lipase
Ligand
BDBM50520683
Substrate
Meas. Tech.
ChEMBL_1881824 (CHEMBL4383323)
IC50
363±n/a nM
Citation
 Ameryckx, AThabault, LPochet, LLeimanis, SPoupaert, JHWouters, JJoris, BVan Bambeke, FFrédérick, R 1-(2-Hydroxybenzoyl)-thiosemicarbazides are promising antimicrobial agents targeting d-alanine-d-alanine ligase in bacterio. Eur J Med Chem 159:324-338 (2018)  
Target
Name:
Monoglyceride lipase
Synonyms:
HU-K5 Lysophospholipase-like MGL MGLL_HUMAN
Type:
Hydrolase
Mol. Mass.:
33264.56
Organism:
Homo sapiens (Human)
Description:
Human recombinant MGL (Cayman Chemical, cat# 10008354).
Residue:
303
  
Inhibitor
Name:
BDBM50520683
Synonyms:
CHEMBL4476621
Type:
Small organic molecule
Emp. Form.:
C14H11Cl2N3O2S
Mol. Mass.:
356.227
SMILES:
Oc1ccccc1C(=O)NNC(=S)Nc1ccc(Cl)c(Cl)c1
: