Target
Potassium voltage-gated channel subfamily H member 2
Ligand
BDBM50520683
Substrate
Meas. Tech.
ChEMBL_1881829 (CHEMBL4383328)
IC50
80±n/a nM
Citation
 Ameryckx, AThabault, LPochet, LLeimanis, SPoupaert, JHWouters, JJoris, BVan Bambeke, FFrédérick, R 1-(2-Hydroxybenzoyl)-thiosemicarbazides are promising antimicrobial agents targeting d-alanine-d-alanine ligase in bacterio. Eur J Med Chem 159:324-338 (2018)  
Target
Name:
Potassium voltage-gated channel subfamily H member 2
Synonyms:
1,3-beta-glucan synthase component GLS2 ERG Eag-related protein 1 Ether-a-go-go-related gene (HERG) Ether-a-go-go-related gene potassium channel 1 Ether-a-go-go-related gene potassium channel 1 (hERG1) Ether-a-go-go-related protein 1 H-ERG KCNH2 Potassium voltage-gated channel subfamily H member 2 (hERG) Voltage-gated potassium channel subunit Kv11.1 hERG Potassium Channel 1 | putative potassium channel subunit
Type:
Multi-pass membrane protein
Mol. Mass.:
126672.65
Organism:
Homo sapiens (Human)
Description:
Q12809
Residue:
1159
  
Inhibitor
Name:
BDBM50520683
Synonyms:
CHEMBL4476621
Type:
Small organic molecule
Emp. Form.:
C14H11Cl2N3O2S
Mol. Mass.:
356.227
SMILES:
Oc1ccccc1C(=O)NNC(=S)Nc1ccc(Cl)c(Cl)c1
: