Target
Acetylcholinesterase
Ligand
BDBM50520683
Substrate
Meas. Tech.
ChEMBL_1881813 (CHEMBL4383312)
IC50
520±n/a nM
Citation
 Ameryckx, AThabault, LPochet, LLeimanis, SPoupaert, JHWouters, JJoris, BVan Bambeke, FFrédérick, R 1-(2-Hydroxybenzoyl)-thiosemicarbazides are promising antimicrobial agents targeting d-alanine-d-alanine ligase in bacterio. Eur J Med Chem 159:324-338 (2018)  
Target
Name:
Acetylcholinesterase
Synonyms:
ACES_HUMAN Acetylcholinesterase (AChE) | Acetylcholinesterase (human AChE)
Type:
Enzyme
Mol. Mass.:
67792.70
Organism:
Homo sapiens (Human)
Description:
P22303
Residue:
614
  
Inhibitor
Name:
BDBM50520683
Synonyms:
CHEMBL4476621
Type:
Small organic molecule
Emp. Form.:
C14H11Cl2N3O2S
Mol. Mass.:
356.227
SMILES:
Oc1ccccc1C(=O)NNC(=S)Nc1ccc(Cl)c(Cl)c1
: