Target
Prostaglandin G/H synthase 1
Ligand
BDBM50520683
Substrate
Meas. Tech.
ChEMBL_1881818 (CHEMBL4383317)
IC50
8.0±n/a nM
Citation
 Ameryckx, AThabault, LPochet, LLeimanis, SPoupaert, JHWouters, JJoris, BVan Bambeke, FFrédérick, R 1-(2-Hydroxybenzoyl)-thiosemicarbazides are promising antimicrobial agents targeting d-alanine-d-alanine ligase in bacterio. Eur J Med Chem 159:324-338 (2018)  
Target
Name:
Prostaglandin G/H synthase 1
Synonyms:
COX-1 Cyclooxygenase Cyclooxygenase-1 (COX-1) PTGS1 | Prostaglandin G/H synthase (cyclooxygenase)
Type:
Enzyme
Mol. Mass.:
68692.62
Organism:
Homo sapiens (Human)
Description:
P23219
Residue:
599
  
Inhibitor
Name:
BDBM50520683
Synonyms:
CHEMBL4476621
Type:
Small organic molecule
Emp. Form.:
C14H11Cl2N3O2S
Mol. Mass.:
356.227
SMILES:
Oc1ccccc1C(=O)NNC(=S)Nc1ccc(Cl)c(Cl)c1
: