Target
D-3-phosphoglycerate dehydrogenase
Ligand
BDBM50520683
Substrate
Meas. Tech.
ChEMBL_1881827 (CHEMBL4383326)
IC50
8700±n/a nM
Citation
 Ameryckx, AThabault, LPochet, LLeimanis, SPoupaert, JHWouters, JJoris, BVan Bambeke, FFrédérick, R 1-(2-Hydroxybenzoyl)-thiosemicarbazides are promising antimicrobial agents targeting d-alanine-d-alanine ligase in bacterio. Eur J Med Chem 159:324-338 (2018)  
Target
Name:
D-3-phosphoglycerate dehydrogenase
Synonyms:
D-3-phosphoglycerate dehydrogenase PHGDH SERA_HUMAN
Type:
Protein
Mol. Mass.:
56650.89
Organism:
Homo sapiens (Human)
Description:
Residue:
533
  
Inhibitor
Name:
BDBM50520683
Synonyms:
CHEMBL4476621
Type:
Small organic molecule
Emp. Form.:
C14H11Cl2N3O2S
Mol. Mass.:
356.227
SMILES:
Oc1ccccc1C(=O)NNC(=S)Nc1ccc(Cl)c(Cl)c1
: