Target
Retinoic acid receptor alpha
Ligand
BDBM50029774
Substrate
Meas. Tech.
ChEBML_195319
Kd
16±n/a nM
Citation
 Johnson, ATWang, LGillett, SJChandraratna, RA High affinity retinoic acid receptor antagonists: analogs of AGN 193109. Bioorg Med Chem Lett 9:573-6 (1999)  
Target
Name:
Retinoic acid receptor alpha
Synonyms:
NR1B1 RAR-alpha RARA_HUMAN Retinoic acid receptor alpha/Retinoid X receptor alpha Retinoid receptor
Type:
PROTEIN
Mol. Mass.:
50778.87
Organism:
Homo sapiens (Human)
Description:
ChEMBL_1466191
Residue:
462
  
Inhibitor
Name:
BDBM50029774
Synonyms:
4-(5,5-Dimethyl-8-p-tolyl-5,6-dihydro-naphthalen-2-ylethynyl)-benzoic acid | CHEMBL358145
Type:
Small organic molecule
Emp. Form.:
C28H24O2
Mol. Mass.:
392.489
SMILES:
Cc1ccc(cc1)C1=CCC(C)(C)c2ccc(cc12)C#Cc1ccc(cc1)C(O)=O
: