Target
Retinoic acid receptor alpha
Ligand
BDBM50075877
Substrate
Meas. Tech.
ChEBML_225937
Kd
15±n/a nM
Citation
 Vuligonda, VStandeven, AMEscobar, MChandraratna, RA A new class of potent RAR antagonists: dihydroanthracenyl, benzochromenyl and benzothiochromenyl retinoids. Bioorg Med Chem Lett 9:743-8 (1999)  
Target
Name:
Retinoic acid receptor alpha
Synonyms:
NR1B1 RAR-alpha RARA_HUMAN Retinoic acid receptor alpha/Retinoid X receptor alpha Retinoid receptor
Type:
PROTEIN
Mol. Mass.:
50778.87
Organism:
Homo sapiens (Human)
Description:
ChEMBL_1466191
Residue:
462
  
Inhibitor
Name:
BDBM50075877
Synonyms:
4-[5,5-Dimethyl-8-(5-methyl-thiophen-2-yl)-5,6-dihydro-anthracen-2-yl]-benzoic acid | CHEMBL165417
Type:
Small organic molecule
Emp. Form.:
C28H24O2S
Mol. Mass.:
424.554
SMILES:
Cc1ccc(s1)C1=CCC(C)(C)c2cc3ccc(cc3cc12)-c1ccc(cc1)C(O)=O
: