Target
Retinoic acid receptor beta
Ligand
BDBM50075877
Substrate
Meas. Tech.
ChEMBL_225941 (CHEMBL846506)
IC50
15±n/a nM
Citation
 Vuligonda, VStandeven, AMEscobar, MChandraratna, RA A new class of potent RAR antagonists: dihydroanthracenyl, benzochromenyl and benzothiochromenyl retinoids. Bioorg Med Chem Lett 9:743-8 (1999)  
Target
Name:
Retinoic acid receptor beta
Synonyms:
HAP NR1B2 RAR-beta RARB Retinoic acid receptor RXR-alpha/Retinoic acid receptor beta Retinoid receptor
Type:
PROTEIN
Mol. Mass.:
50498.70
Organism:
Homo sapiens (Human)
Description:
ChEMBL_1458015
Residue:
455
  
Inhibitor
Name:
BDBM50075877
Synonyms:
4-[5,5-Dimethyl-8-(5-methyl-thiophen-2-yl)-5,6-dihydro-anthracen-2-yl]-benzoic acid | CHEMBL165417
Type:
Small organic molecule
Emp. Form.:
C28H24O2S
Mol. Mass.:
424.554
SMILES:
Cc1ccc(s1)C1=CCC(C)(C)c2cc3ccc(cc3cc12)-c1ccc(cc1)C(O)=O
: