Target
Retinoic acid receptor gamma
Ligand
BDBM50075880
Substrate
Meas. Tech.
ChEBML_225945
Kd
7±n/a nM
Citation
 Vuligonda, VStandeven, AMEscobar, MChandraratna, RA A new class of potent RAR antagonists: dihydroanthracenyl, benzochromenyl and benzothiochromenyl retinoids. Bioorg Med Chem Lett 9:743-8 (1999)  
Target
Name:
Retinoic acid receptor gamma
Synonyms:
NR1B3 RAR-gamma RARG_HUMAN Retinoic acid receptor gamma | Retinoid receptor
Type:
PROTEIN
Mol. Mass.:
50345.43
Organism:
Homo sapiens (Human)
Description:
ChEMBL_1458016
Residue:
454
  
Inhibitor
Name:
BDBM50075880
Synonyms:
4-(5,5-Dimethyl-8-p-tolyl-5,6-dihydro-anthracen-2-yl)-benzoic acid | CHEMBL162393
Type:
Small organic molecule
Emp. Form.:
C30H26O2
Mol. Mass.:
418.5262
SMILES:
Cc1ccc(cc1)C1=CCC(C)(C)c2cc3ccc(cc3cc12)-c1ccc(cc1)C(O)=O
: