Target
Retinoic acid receptor beta
Ligand
BDBM50075876
Substrate
Meas. Tech.
ChEMBL_225943 (CHEMBL843951)
Kd
12±n/a nM
Citation
 Vuligonda, VStandeven, AMEscobar, MChandraratna, RA A new class of potent RAR antagonists: dihydroanthracenyl, benzochromenyl and benzothiochromenyl retinoids. Bioorg Med Chem Lett 9:743-8 (1999)  
Target
Name:
Retinoic acid receptor beta
Synonyms:
HAP NR1B2 RAR-beta RARB Retinoic acid receptor RXR-alpha/Retinoic acid receptor beta Retinoid receptor
Type:
PROTEIN
Mol. Mass.:
50498.70
Organism:
Homo sapiens (Human)
Description:
ChEMBL_1458015
Residue:
455
  
Inhibitor
Name:
BDBM50075876
Synonyms:
4-[2,2-Dimethyl-4-(5-methyl-thiophen-2-yl)-2H-benzo[g]chromen-7-yl]-benzoic acid | CHEMBL163530
Type:
Small organic molecule
Emp. Form.:
C27H22O3S
Mol. Mass.:
426.527
SMILES:
Cc1ccc(s1)C1=CC(C)(C)Oc2cc3ccc(cc3cc12)-c1ccc(cc1)C(O)=O
: