Target
Potassium voltage-gated channel subfamily KQT member 4
Ligand
BDBM50521286
Substrate
Meas. Tech.
ChEMBL_1883897 (CHEMBL4385396)
EC50
2030±n/a nM
Citation
 Wang, LQiao, GHHu, HNGao, ZBNan, FJ Discovery of Novel Retigabine Derivatives as Potent KCNQ4 and KCNQ5 Channel Agonists with Improved Specificity. ACS Med Chem Lett 10:27-33 (2019)  
Target
Name:
Potassium voltage-gated channel subfamily KQT member 4
Synonyms:
KCNQ (Kv7) potassium channel KCNQ4_HUMAN Potassium channel subunit alpha KvLQT4 Voltage-gated potassium channel subunit Kv7.4
Type:
PROTEIN
Mol. Mass.:
77131.10
Organism:
Homo sapiens (Human)
Description:
ChEMBL_1520985
Residue:
695
  
Inhibitor
Name:
BDBM50521286
Synonyms:
CHEMBL4450214
Type:
Small organic molecule
Emp. Form.:
C26H32FN3O4
Mol. Mass.:
469.5484
SMILES:
CC(C)(C)OC(=O)Nc1ccc(cc1NC(=O)OC(C)(C)C)N(CC#C)Cc1ccc(F)cc1
: