Target
Cannabinoid receptor 1
Ligand
BDBM50521898
Substrate
Meas. Tech.
ChEMBL_1885521 (CHEMBL4387103)
Ki
2.0±n/a nM
Citation
 Amato, GWiethe, RManke, AVasukuttan, VSnyder, RRunyon, SMaitra, R Functionalized 6-(piperidin-1-yl)-8,9-diphenyl purines as inverse agonists of the CB1 receptor - SAR efforts towards selectivity and peripheralization. Bioorg Med Chem 27:3632-3649 (2019)  
Target
Name:
Cannabinoid receptor 1
Synonyms:
CANN6 CB-R CNR CNR1_HUMAN Cannabinoid receptor Cannabinoid receptor 1 (brain)
Type:
G Protein-Coupled Receptor (GPCR)
Mol. Mass.:
52868.96
Organism:
Homo sapiens (Human)
Description:
P21554
Residue:
472
  
Inhibitor
Name:
BDBM50521898
Synonyms:
CHEMBL4441517
Type:
Small organic molecule
Emp. Form.:
C29H22Cl2F2N6O
Mol. Mass.:
579.427
SMILES:
Fc1ccc(C(=O)NC2CCN(CC2)c2ncnc3n(c(nc23)-c2ccccc2Cl)-c2ccc(Cl)cc2)c(F)c1
: