Target
Cannabinoid receptor 1
Ligand
BDBM50521905
Substrate
Meas. Tech.
ChEMBL_1885521 (CHEMBL4387103)
Ki
1.6±n/a nM
Citation
 Amato, GWiethe, RManke, AVasukuttan, VSnyder, RRunyon, SMaitra, R Functionalized 6-(piperidin-1-yl)-8,9-diphenyl purines as inverse agonists of the CB1 receptor - SAR efforts towards selectivity and peripheralization. Bioorg Med Chem 27:3632-3649 (2019)  
Target
Name:
Cannabinoid receptor 1
Synonyms:
CANN6 CB-R CNR CNR1_HUMAN Cannabinoid receptor Cannabinoid receptor 1 (brain)
Type:
G Protein-Coupled Receptor (GPCR)
Mol. Mass.:
52868.96
Organism:
Homo sapiens (Human)
Description:
P21554
Residue:
472
  
Inhibitor
Name:
BDBM50521905
Synonyms:
CHEMBL4440527
Type:
Small organic molecule
Emp. Form.:
C28H23ClF3N7O3S
Mol. Mass.:
630.041
SMILES:
FC(F)Oc1ccc(cn1)-n1c(nc2c(ncnc12)N1CCC(CC1)NS(=O)(=O)c1ccccc1F)-c1ccccc1Cl
: