Target
Arginase
Ligand
BDBM50521942
Substrate
Meas. Tech.
ChEMBL_1885817 (CHEMBL4387399)
IC50
12000±n/a nM
Citation
 Crizanto de Lima, ECastelo-Branco, FSMaquiaveli, CCFarias, ABRennó, MNBoechat, NSilva, ER Phenylhydrazides as inhibitors of Leishmania amazonensis arginase and antileishmanial activity. Bioorg Med Chem 27:3853-3859 (2019)  
Target
Name:
Arginase
Synonyms:
Type:
PROTEIN
Mol. Mass.:
36149.67
Organism:
Leishmania amazonensis
Description:
ChEMBL_107995
Residue:
329
  
Inhibitor
Name:
BDBM50521942
Synonyms:
CHEMBL4216180
Type:
Small organic molecule
Emp. Form.:
C16H15F2N3O2
Mol. Mass.:
319.306
SMILES:
CC(=O)Nc1ccccc1C(F)(F)C(=O)NNc1ccccc1
: