Target
Poly [ADP-ribose] polymerase tankyrase-1
Ligand
BDBM50188594
Substrate
Meas. Tech.
ChEMBL_1886445 (CHEMBL4388122)
IC50
7.5±n/a nM
Citation
 Shirai, FTsumura, TYashiroda, YYuki, HNiwa, HSato, SChikada, TKoda, YWashizuka, KYoshimoto, NAbe, MOnuki, TMazaki, YHirama, CFukami, TWatanabe, HHonma, TUmehara, TShirouzu, MOkue, MKano, YWatanabe, TKitamura, KShitara, EMuramatsu, YYoshida, HMizutani, ASeimiya, HYoshida, MKoyama, H Discovery of Novel Spiroindoline Derivatives as Selective Tankyrase Inhibitors. J Med Chem 62:3407-3427 (2019)  
Target
Name:
Poly [ADP-ribose] polymerase tankyrase-1
Synonyms:
(ARTD5 or PARP5a) PARPL Poly [ADP-ribose] polymerase tankyrase-1 TINF1 TNKS1 Tankyrase 1 Tankyrase-1 Tankyrase-1 (TNKS1)
Type:
Enzyme
Mol. Mass.:
142058.03
Organism:
Homo sapiens (Human)
Description:
O95271
Residue:
1327
  
Inhibitor
Name:
BDBM50188594
Synonyms:
CHEBI:62878 | CHEMBL1086580
Type:
Small organic molecule
Emp. Form.:
C14H11F3N2OS
Mol. Mass.:
312.31
SMILES:
Oc1nc(nc2CCSCc12)-c1ccc(cc1)C(F)(F)F
: