Target
Muscarinic acetylcholine receptor M3
Ligand
BDBM50417445
Substrate
Meas. Tech.
ChEMBL_1888526 (CHEMBL4390203)
Ki
0.810000±n/a nM
Citation
 Yamashita, YTanaka, KIYamakawa, NAsano, TKanda, YTakafuji, AKawahara, MTakenaga, MFukunishi, YMizushima, T Chemical modification-mediated optimisation of bronchodilatory activity of mepenzolate, a muscarinic receptor antagonist with anti-inflammatory activity. Bioorg Med Chem 27:3339-3346 (2019)  
Target
Name:
Muscarinic acetylcholine receptor M3
Synonyms:
ACM3_HUMAN Cholinergic, muscarinic M3 Muscarinic receptor M3 | RecName: Full=Muscarinic acetylcholine receptor M3
Type:
Enzyme
Mol. Mass.:
66151.03
Organism:
Homo sapiens (Human)
Description:
P20309
Residue:
590
  
Inhibitor
Name:
BDBM50417445
Synonyms:
AHR-504 GLYCOPYRROLATE
Type:
Small organic molecule
Emp. Form.:
C19H28NO3
Mol. Mass.:
318.43
SMILES:
C[N+]1(C)CCC(C1)OC(=O)C(O)(C1CCCC1)c1ccccc1
: