Target
Scytalone dehydratase
Ligand
BDBM50078290
Substrate
Meas. Tech.
ChEBML_199522
Ki
0.080000±n/a nM
Citation
 Jordan, DBLessen, TAWawrzak, ZBisaha, JJGehret, TCHansen, SLSchwartz, RSBasarab, GS Design of scytalone dehydratase inhibitors as rice blast fungicides: (N-phenoxypropyl)-carboxamides. Bioorg Med Chem Lett 9:1607-12 (1999)  
Target
Name:
Scytalone dehydratase
Synonyms:
SCYD_MAGO7 Scytalone dehydratase
Type:
PROTEIN
Mol. Mass.:
20248.63
Organism:
Magnaporthe grisea
Description:
ChEMBL_199536
Residue:
172
  
Inhibitor
Name:
BDBM50078290
Synonyms:
(R)-2-Cyano-N-[(R)-2-(2-fluoro-phenoxy)-1-methyl-ethyl]-3,3-dimethyl-butyramide | CHEMBL295019
Type:
Small organic molecule
Emp. Form.:
C16H21FN2O2
Mol. Mass.:
292.3485
SMILES:
C[C@H](COc1ccccc1F)NC(=O)[C@@H](C#N)C(C)(C)C
: