Target
Scytalone dehydratase
Ligand
BDBM50078310
Substrate
Meas. Tech.
ChEBML_199523
Ki
0.034±n/a nM
Citation
 Basarab, GSJordan, DBGehret, TCSchwartz, RSWawrzak, Z Design of scytalone dehydratase inhibitors as rice blast fungicides: derivatives of norephedrine. Bioorg Med Chem Lett 9:1613-8 (1999)  
Target
Name:
Scytalone dehydratase
Synonyms:
SCYD_MAGO7 Scytalone dehydratase
Type:
PROTEIN
Mol. Mass.:
20248.63
Organism:
Magnaporthe grisea
Description:
ChEMBL_199536
Residue:
172
  
Inhibitor
Name:
BDBM50078310
Synonyms:
CHEMBL289791 | N-[(1R,2S)-2-(5-Bromo-2-cyano-phenoxy)-1-methyl-2-phenyl-ethyl]-2-cyano-butyramide
Type:
Small organic molecule
Emp. Form.:
C21H20BrN3O2
Mol. Mass.:
426.306
SMILES:
CCC(C#N)C(=O)N[C@H](C)[C@@H](Oc1cc(Br)ccc1C#N)c1ccccc1
: