Target
Sphingosine kinase 1
Ligand
BDBM50523496
Substrate
Meas. Tech.
ChEMBL_1890496 (CHEMBL4392250)
IC50
11±n/a nM
Citation
 Adams, DRTawati, SBerretta, GRivas, PLBaiget, JJiang, ZAlsfouk, AMackay, SPPyne, NJPyne, S Topographical Mapping of Isoform-Selectivity Determinants for J-Channel-Binding Inhibitors of Sphingosine Kinases 1 and 2. J Med Chem 62:3658-3676 (2019)  
Target
Name:
Sphingosine kinase 1
Synonyms:
SK1 SPHK1 SPK Sphingosine kinase 1 (SPHK1) | Sphingosine kinase types 1 (SphK1)
Type:
Enzyme
Mol. Mass.:
42521.16
Organism:
Homo sapiens (Human)
Description:
Q9NYA1
Residue:
384
  
Inhibitor
Name:
BDBM50523496
Synonyms:
CHEMBL4444218
Type:
Small organic molecule
Emp. Form.:
C25H27NO5S
Mol. Mass.:
453.551
SMILES:
OC[C@H]1CCCN1Cc1ccc(COc2cccc(OS(=O)(=O)c3ccccc3)c2)cc1
: