Target
Sphingosine kinase 1
Ligand
BDBM50523494
Substrate
Meas. Tech.
ChEMBL_1890496 (CHEMBL4392250)
IC50
14±n/a nM
Citation
 Adams, DRTawati, SBerretta, GRivas, PLBaiget, JJiang, ZAlsfouk, AMackay, SPPyne, NJPyne, S Topographical Mapping of Isoform-Selectivity Determinants for J-Channel-Binding Inhibitors of Sphingosine Kinases 1 and 2. J Med Chem 62:3658-3676 (2019)  
Target
Name:
Sphingosine kinase 1
Synonyms:
SK1 SPHK1 SPK Sphingosine kinase 1 (SPHK1) | Sphingosine kinase types 1 (SphK1)
Type:
Enzyme
Mol. Mass.:
42521.16
Organism:
Homo sapiens (Human)
Description:
Q9NYA1
Residue:
384
  
Inhibitor
Name:
BDBM50523494
Synonyms:
CHEMBL4574678
Type:
Small organic molecule
Emp. Form.:
C26H29NO3
Mol. Mass.:
403.5134
SMILES:
OC[C@H]1CCCN1Cc1ccc(COc2cccc(OCc3ccccc3)c2)cc1
: