Target
Sphingosine kinase 1
Ligand
BDBM50523499
Substrate
Meas. Tech.
ChEMBL_1890496 (CHEMBL4392250)
IC50
>3000±n/a nM
Citation
 Adams, DRTawati, SBerretta, GRivas, PLBaiget, JJiang, ZAlsfouk, AMackay, SPPyne, NJPyne, S Topographical Mapping of Isoform-Selectivity Determinants for J-Channel-Binding Inhibitors of Sphingosine Kinases 1 and 2. J Med Chem 62:3658-3676 (2019)  
Target
Name:
Sphingosine kinase 1
Synonyms:
SK1 SPHK1 SPK Sphingosine kinase 1 (SPHK1) | Sphingosine kinase types 1 (SphK1)
Type:
Enzyme
Mol. Mass.:
42521.16
Organism:
Homo sapiens (Human)
Description:
Q9NYA1
Residue:
384
  
Inhibitor
Name:
BDBM50523499
Synonyms:
CHEMBL4448423
Type:
Small organic molecule
Emp. Form.:
C27H31NO4
Mol. Mass.:
433.5393
SMILES:
COc1ccc(COc2cccc(OCc3ccc(CN4CCC[C@@H]4CO)cc3)c2)cc1
: