Target
Sphingosine kinase 2
Ligand
BDBM50523497
Substrate
Meas. Tech.
ChEMBL_1890497 (CHEMBL4392251)
IC50
143±n/a nM
Citation
 Adams, DRTawati, SBerretta, GRivas, PLBaiget, JJiang, ZAlsfouk, AMackay, SPPyne, NJPyne, S Topographical Mapping of Isoform-Selectivity Determinants for J-Channel-Binding Inhibitors of Sphingosine Kinases 1 and 2. J Med Chem 62:3658-3676 (2019)  
Target
Name:
Sphingosine kinase 2
Synonyms:
SK 2 SPHK2 SPK 2 Sphingosine kinase types 2 (SphK2)
Type:
Protein
Mol. Mass.:
69221.44
Organism:
Homo sapiens (Human)
Description:
Q9NRA0
Residue:
654
  
Inhibitor
Name:
BDBM50523497
Synonyms:
CHEMBL4474024
Type:
Small organic molecule
Emp. Form.:
C26H28FNO3
Mol. Mass.:
421.5038
SMILES:
OC[C@H]1CCCN1Cc1ccc(COc2cccc(OCc3cccc(F)c3)c2)cc1
: